Reaction Details
TargetCathepsin B
LigandBDBM36813
Substrate/Competitorn/a
Meas. Tech.Inhibition Assay
pH5.5±0
Temperature298.15±0 K
IC50 60±0.0 nM
Citation Bogyo, MVerhelst, SBellingard-Dubouchaud, VToba, SGreenbaum, D Selective targeting of lysosomal cysteine proteases with radiolabeled electrophilic substrate analogs. Chem Biol7:27-38 (2000) 
 
Cathepsin B
Name:Cathepsin B
Type:Enzyme
Mol. Mass.:37819.69
Organism:Homo sapiens (Human)
Description:gi_63102437
Residue:339
BDBM36813
NameBDBM36813
Synonyms:CA-074b
TypeSmall organic molecule
Emp. Form.C18H31N3O5
Mol. Mass.369.4558
SMILESCCC(C)[C@H](NC(=O)C1OC1NCC(C)C)C(=O)N1CCC[C@@H]1C(O)=O