Reaction Details
Target5-hydroxytryptamine receptor 1A
LigandBDBM264011
Substrate/Competitorn/a
Meas. Tech.Human 5-HT1A Receptor Binding Assay
pH7.4±n/a
Ki 1.90±n/a nM
Commentsextracted
Citation Zhang, YJin, CZhou, R Substituted piperazine compounds and methods of use thereof US Patent US9714232 Publication Date 7/25/2017
 
5-hydroxytryptamine receptor 1A
Name:5-hydroxytryptamine receptor 1A
Type:n/a
Mol. Mass.:46122.49
Organism:Homo sapiens (Human)
Description:n/a
Residue:422
BDBM264011
NameBDBM264011
Synonyms:3-(4-(4-(4-(2-oxopiperidin-1-yl)phenyl)piperazin-1-yl)butyl)-1H-indole-5-carbonitrile | US9714232, 2
TypeSmall organic molecule
Emp. Form.C28H33N5O
Mol. Mass.455.5945
SMILESO=C1CCCCN1c1ccc(cc1)N1CCN(CCCCc2c[nH]c3ccc(cc23)C#N)CC1