Reaction Details
Target5-hydroxytryptamine receptor 1A
LigandBDBM264099
Substrate/Competitorn/a
Meas. Tech.Human 5-HT1A Receptor Binding Assay
pH7.4±n/a
Ki 0.870±n/a nM
Commentsextracted
Citation Zhang, YJin, CZhou, R Substituted piperazine compounds and methods of use thereof US Patent US9714232 Publication Date 7/25/2017
 
5-hydroxytryptamine receptor 1A
Name:5-hydroxytryptamine receptor 1A
Type:n/a
Mol. Mass.:46122.49
Organism:Homo sapiens (Human)
Description:n/a
Residue:422
BDBM264099
NameBDBM264099
Synonyms:1-(4-(4-(3-(5-fluoro-1H-indol-3-yl)propyl)piperazin-1-yl)phenyl)pyridin-2(1H)-one | US9714232, 12
TypeSmall organic molecule
Emp. Form.C26H27FN4O
Mol. Mass.430.5172
SMILESFc1ccc2[nH]cc(CCCN3CCN(CC3)c3ccc(cc3)-n3ccccc3=O)c2c1