Reaction Details
TargetArachidonate 5-lipoxygenase-activating protein
LigandBDBM145772
Substrate/Competitorn/a
Meas. Tech.FLAP Binding Assay
Ki 1.10±n/a nM
Citation Chai, WDvorak, CAEccles, WEdwards, JPGoldberg, SDKrawczuk, PJLebsack, ADLiu, JPippel, DJSales, ZSTanis, VMTichenor, MSWiener, JJ 1,2,6-substituted benzimidazoles as flap modulators US Patent US9695149 Publication Date 7/4/2017
 
Arachidonate 5-lipoxygenase-activating protein
Name:Arachidonate 5-lipoxygenase-activating protein
Type:Enzyme
Mol. Mass.:18159.90
Organism:Homo sapiens (Human)
Description:P20292
Residue:161
BDBM145772
NameBDBM145772
Synonyms:US8952177, 126 US9695149, 126
TypeSmall organic molecule
Emp. Form.C28H26BrF2N3O3
Mol. Mass.570.425
SMILESCc1ccc(COc2ccc3nc([C@H]4CCCC[C@H]4C(O)=O)n(Cc4c(F)cc(Br)cc4F)c3c2)nc1