Reaction Details
TargetArachidonate 5-lipoxygenase-activating protein
LigandBDBM145807
Substrate/Competitorn/a
Meas. Tech.FLAP Binding Assay
Ki 0.96±n/a nM
Citation Chai, WDvorak, CAEccles, WEdwards, JPGoldberg, SDKrawczuk, PJLebsack, ADLiu, JPippel, DJSales, ZSTanis, VMTichenor, MSWiener, JJ 1,2,6-substituted benzimidazoles as flap modulators US Patent US9695149 Publication Date 7/4/2017
 
Arachidonate 5-lipoxygenase-activating protein
Name:Arachidonate 5-lipoxygenase-activating protein
Type:Enzyme
Mol. Mass.:18159.90
Organism:Homo sapiens (Human)
Description:P20292
Residue:161
BDBM145807
NameBDBM145807
Synonyms:US8952177, 163 US9695149, 163
TypeSmall organic molecule
Emp. Form.C32H33F3N4O3
Mol. Mass.578.6246
SMILESCc1ccc(COc2ccc3nc([C@H]4CCCC[C@H]4C(O)=O)n(Cc4ccc(cc4F)N4CCC(F)(F)C4)c3c2)nc1