Reaction Details
TargetRho-associated protein kinase 2
LigandBDBM39220
Substrate/Competitorn/a
Meas. Tech.Dose-response biochemical assay of inhibitors of Rho kinase 2 (Rock2)
IC50 55650±n/a nM
Citation PubChem, PC Dose-response biochemical assay of inhibitors of Rho kinase 2 (Rock2)  PubChem Bioassay(2007)[AID]
 
Rho-associated protein kinase 2
Name:Rho-associated protein kinase 2
Type:Protein
Mol. Mass.:160885.43
Organism:Homo sapiens (Human)
Description:O75116
Residue:1388
BDBM39220
NameBDBM39220
Synonyms:(1-oxidanylidene-2H-isoquinolin-5-yl) benzoate CHEMBL1584950 SMR000038018 benzoic acid (1-oxo-2H-isoquinolin-5-yl) ester | cid_659976
TypeSmall organic molecule
Emp. Form.C16H11NO3
Mol. Mass.265.2634
SMILESO=C(Oc1cccc2c1cc[nH]c2=O)c1ccccc1