Reaction Details
TargetRho-associated protein kinase 2
LigandBDBM39248
Substrate/Competitorn/a
Meas. Tech.Dose-response biochemical assay of inhibitors of Rho kinase 2 (Rock2)
IC50 9218±n/a nM
Citation PubChem, PC Dose-response biochemical assay of inhibitors of Rho kinase 2 (Rock2)  PubChem Bioassay(2007)[AID]
 
Rho-associated protein kinase 2
Name:Rho-associated protein kinase 2
Type:Protein
Mol. Mass.:160885.43
Organism:Homo sapiens (Human)
Description:O75116
Residue:1388
BDBM39248
NameBDBM39248
Synonyms:5-(4-keto-8-methoxy-2-thioxo-1,5-dihydropyrimid[5,4-b]indol-3-yl)-N-(2-pyrrolidinoethyl)valeramide 5-(8-methoxy-4-oxo-2-sulfanylidene-1,5-dihydropyrimido[5,4-b]indol-3-yl)-N-(2-pyrrolidin-1-ylethyl)pentanamide 5-(8-methoxy-4-oxo-2-thioxo-1,2,4,5-tetrahydro-3H-pyrimido[5,4-b]indol-3-yl)-N-(2-pyrrolidin-1-ylethyl)pentanamide SMR000028553 | cid_3244338
TypeSmall organic molecule
Emp. Form.C22H29N5O3S
Mol. Mass.443.562
SMILESCOc1ccc2[nH]c3c([nH]c(=S)n(CCCCC(=O)NCCN4CCCC4)c3=O)c2c1