Reaction Details
TargetRho-associated protein kinase 2
LigandBDBM38617
Substrate/Competitorn/a
Meas. Tech.Dose-response biochemical assay of inhibitors of Rho kinase 2 (Rock2)
IC50>19880±n/a nM
Citation PubChem, PC Dose-response biochemical assay of inhibitors of Rho kinase 2 (Rock2)  PubChem Bioassay(2007)[AID]
 
Rho-associated protein kinase 2
Name:Rho-associated protein kinase 2
Type:Protein
Mol. Mass.:160885.43
Organism:Homo sapiens (Human)
Description:O75116
Residue:1388
BDBM38617
NameBDBM38617
Synonyms:MLS000092916 N-[2-(diethylamino)ethyl]-5-(8-methoxy-4-oxidanylidene-2-sulfanylidene-1,5-dihydropyrimido[5,4-b]indol-3-yl)pentanamide N-[2-(diethylamino)ethyl]-5-(8-methoxy-4-oxo-2-thioxo-1,2,4,5-tetrahydro-3H-pyrimido[5,4-b]indol-3-yl)pentanamide cid_3244883
TypeSmall organic molecule
Emp. Form.C22H31N5O3S
Mol. Mass.445.578
SMILESCCN(CC)CCNC(=O)CCCCn1c(=S)[nH]c2c3cc(OC)ccc3[nH]c2c1=O