Reaction Details
TargetGenome polyprotein
LigandBDBM50027886
Substrate/Competitorn/a
Meas. Tech.West Nile Virus NS2bNS3 Proteinase Inhibitor Dose Response Confirmation.
IC50>50000±n/a nM
Citation PubChem, PC West Nile Virus NS2bNS3 Proteinase Inhibitor Dose Response Confirmation. PubChem Bioassay(2007)[AID]
 
Genome polyprotein
Name:Genome polyprotein
Type:PROTEIN
Mol. Mass.:380170.63
Organism:West Nile virus
Description:ChEMBL_1438217
Residue:3430
BDBM50027886
NameBDBM50027886
Synonyms:1-Butyl-3-(p-methylphenylsulfonyl)urea 1-Butyl-3-tosylurea N-(4-Methylphenylsulfonyl)-N'-butylurea N-Butyl-N'-(p-tolylsulfonyl)urea N-n-Butyl-N'-tosylurea TOLBUTAMIDE
TypeSmall organic molecule
Emp. Form.C12H18N2O3S
Mol. Mass.270.348
SMILESCCCCNC(=O)NS(=O)(=O)c1ccc(C)cc1