Reaction Details
TargetGenome polyprotein
LigandBDBM39351
Substrate/Competitorn/a
Meas. Tech.West Nile Virus NS2bNS3 Proteinase Inhibitor Dose Response Confirmation.
IC50>50000±n/a nM
Citation PubChem, PC West Nile Virus NS2bNS3 Proteinase Inhibitor Dose Response Confirmation. PubChem Bioassay(2007)[AID]
 
Genome polyprotein
Name:Genome polyprotein
Type:PROTEIN
Mol. Mass.:380170.63
Organism:West Nile virus
Description:ChEMBL_1438217
Residue:3430
BDBM39351
NameBDBM39351
Synonyms:CHLOROTHIAZIDE SMR000058429 cid_2720
TypeSmall organic molecule
Emp. Form.C7H6ClN3O4S2
Mol. Mass.295.723
SMILESNS(=O)(=O)c1cc2c(cc1Cl)N=CNS2(=O)=O