Reaction Details
TargetGenome polyprotein
LigandBDBM39379
Substrate/Competitorn/a
Meas. Tech.West Nile Virus NS2bNS3 Proteinase Inhibitor Dose Response Confirmation.
IC50 38573±n/a nM
Citation PubChem, PC West Nile Virus NS2bNS3 Proteinase Inhibitor Dose Response Confirmation. PubChem Bioassay(2007)[AID]
 
Genome polyprotein
Name:Genome polyprotein
Type:PROTEIN
Mol. Mass.:380170.63
Organism:West Nile virus
Description:ChEMBL_1438217
Residue:3430
BDBM39379
NameBDBM39379
Synonyms:MLS000053522 [4-(2,3-dimethylphenyl)-1-piperazinyl]-(2-ethylsulfonyl-3,4-dihydro-1H-isoquinolin-3-yl)methanone [4-(2,3-dimethylphenyl)piperazino]-(2-esyl-3,4-dihydro-1H-isoquinolin-3-yl)methanone | cid_2998045
TypeSmall organic molecule
Emp. Form.C24H31N3O3S
Mol. Mass.441.586
SMILESCCS(=O)(=O)N1Cc2ccccc2CC1C(=O)N1CCN(CC1)c1cccc(C)c1C