Reaction Details
TargetGenome polyprotein
LigandBDBM32778
Substrate/Competitorn/a
Meas. Tech.West Nile Virus NS2bNS3 Proteinase Inhibitor Dose Response Confirmation.
IC50 1353±n/a nM
Citation PubChem, PC West Nile Virus NS2bNS3 Proteinase Inhibitor Dose Response Confirmation. PubChem Bioassay(2007)[AID]
 
Genome polyprotein
Name:Genome polyprotein
Type:PROTEIN
Mol. Mass.:380170.63
Organism:West Nile virus
Description:ChEMBL_1438217
Residue:3430
BDBM32778
NameBDBM32778
Synonyms:MLS000081703 [2-(2-cyanoethyl)-5-methyl-pyrazol-3-yl] benzoate benzoic acid [2-(2-cyanoethyl)-5-methyl-3-pyrazolyl] ester cid_2366780
TypeSmall organic molecule
Emp. Form.C14H13N3O2
Mol. Mass.255.2719
SMILESCc1cc(OC(=O)c2ccccc2)n(CCC#N)n1