Reaction Details
TargetGenome polyprotein
LigandBDBM31700
Substrate/Competitorn/a
Meas. Tech.West Nile Virus NS2bNS3 Proteinase Inhibitor Dose Response Confirmation.
IC50>50000±n/a nM
Citation PubChem, PC West Nile Virus NS2bNS3 Proteinase Inhibitor Dose Response Confirmation. PubChem Bioassay(2007)[AID]
 
Genome polyprotein
Name:Genome polyprotein
Type:PROTEIN
Mol. Mass.:380170.63
Organism:West Nile virus
Description:ChEMBL_1438217
Residue:3430
BDBM31700
NameBDBM31700
Synonyms:(5Z)-5-(5-bromo-2-methoxybenzylidene)-2-(2-furyl)[1,3]thiazolo[3,2-b][1,2,4]triazol-6(5H)-one 5-[(5-bromanyl-2-methoxy-phenyl)methylidene]-2-(furan-2-yl)-[1,3]thiazolo[3,2-b][1,2,4]triazol-6-one 5-[(5-bromo-2-methoxyphenyl)methylidene]-2-(furan-2-yl)-[1,3]thiazolo[3,2-b][1,2,4]triazol-6-one SMR000020576 | cid_3236807
TypeSmall organic molecule
Emp. Form.C16H10BrN3O3S
Mol. Mass.404.238
SMILESCOc1ccc(Br)cc1C=c1sc2nc(nn2c1=O)-c1ccco1