Reaction Details
TargetGenome polyprotein
LigandBDBM39392
Substrate/Competitorn/a
Meas. Tech.West Nile Virus NS2bNS3 Proteinase Inhibitor Dose Response Confirmation.
IC50>50000±n/a nM
Citation PubChem, PC West Nile Virus NS2bNS3 Proteinase Inhibitor Dose Response Confirmation. PubChem Bioassay(2007)[AID]
 
Genome polyprotein
Name:Genome polyprotein
Type:PROTEIN
Mol. Mass.:380170.63
Organism:West Nile virus
Description:ChEMBL_1438217
Residue:3430
BDBM39392
NameBDBM39392
Synonyms:3-(2-acetamidoethyl)-5-methoxy-1H-indole-2-carboxylic acid MLS000043538 cid_608124
TypeSmall organic molecule
Emp. Form.C14H16N2O4
Mol. Mass.276.2878
SMILESCOc1ccc2[nH]c(C(O)=O)c(CCNC(C)=O)c2c1