Reaction Details
TargetGenome polyprotein
LigandBDBM39394
Substrate/Competitorn/a
Meas. Tech.West Nile Virus NS2bNS3 Proteinase Inhibitor Dose Response Confirmation.
IC50 297±n/a nM
Citation PubChem, PC West Nile Virus NS2bNS3 Proteinase Inhibitor Dose Response Confirmation. PubChem Bioassay(2007)[AID]
 
Genome polyprotein
Name:Genome polyprotein
Type:PROTEIN
Mol. Mass.:380170.63
Organism:West Nile virus
Description:ChEMBL_1438217
Residue:3430
BDBM39394
NameBDBM39394
Synonyms:2-bromobenzoic acid [5-amino-1-(4-methoxyphenyl)sulfonyl-3-pyrazolyl] ester 5-amino-1-[(4-methoxyphenyl)sulfonyl]-1H-pyrazol-3-yl 2-bromobenzoate SMR000021571 [5-azanyl-1-(4-methoxyphenyl)sulfonyl-pyrazol-3-yl] 2-bromanylbenzoate | cid_3240579
TypeSmall organic molecule
Emp. Form.C17H14BrN3O5S
Mol. Mass.452.279
SMILESCOc1ccc(cc1)S(=O)(=O)n1nc(OC(=O)c2ccccc2Br)cc1N