Reaction Details
TargetGenome polyprotein
LigandBDBM39405
Substrate/Competitorn/a
Meas. Tech.West Nile Virus NS2bNS3 Proteinase Inhibitor Dose Response Confirmation.
IC50>50000±n/a nM
Citation PubChem, PC West Nile Virus NS2bNS3 Proteinase Inhibitor Dose Response Confirmation. PubChem Bioassay(2007)[AID]
 
Genome polyprotein
Name:Genome polyprotein
Type:PROTEIN
Mol. Mass.:380170.63
Organism:West Nile virus
Description:ChEMBL_1438217
Residue:3430
BDBM39405
NameBDBM39405
Synonyms:MLS000065411 SMR000079224 | cid_2965813
TypeSmall organic molecule
Emp. Form.C16H16ClNO3
Mol. Mass.305.756
SMILES[H]C12CC3OC(=O)C(C1C(=O)Nc1ccc(C)c(Cl)c1)C3([H])C2