Reaction Details
TargetM-phase inducer phosphatase 2
LigandBDBM34230
Substrate/Competitorn/a
Meas. Tech.MKP-1 Dual Specificity Protein Tyrosine Phosphatase Probe Assessment: Cdc25B Dose Response Selectivity Assay
IC50>50000±n/a nM
Citation PubChem, PC MKP-1 Dual Specificity Protein Tyrosine Phosphatase Probe Assessment: Cdc25B Dose Response Selectivity Assay PubChem Bioassay(2007)[AID]
 
M-phase inducer phosphatase 2
Name:M-phase inducer phosphatase 2
Type:Protein
Mol. Mass.:64985.27
Organism:Homo sapiens (Human)
Description:n/a
Residue:580
BDBM34230
NameBDBM34230
Synonyms:(Z)-7-[(1R,2S)-2-[(E,3S)-3-hydroxyoct-1-enyl]-5-keto-cyclopent-3-en-1-yl]hept-5-enoic acid (Z)-7-[(1R,2S)-2-[(E,3S)-3-hydroxyoct-1-enyl]-5-oxocyclopent-3-en-1-yl]hept-5-enoic acid MLS000069589 SMR000058790 | cid_5280880
TypeSmall organic molecule
Emp. Form.C20H30O4
Mol. Mass.334.4498
SMILESCCCCC[C@H](O)C=C[C@H]1C=CC(=O)[C@@H]1C\C=C/CCCC(O)=O