Reaction Details
TargetBeta-lactamase
LigandBDBM39846
Substrate/Competitorn/a
Meas. Tech.Inhibition Assay
pH7±0
Ki 6.8e+2±n/a nM
Citation Tondi, DPowers, RACaselli, ENegri, MCBlázquez, JCosti, MPShoichet, BK Structure-based design and in-parallel synthesis of inhibitors of AmpC beta-lactamase. Chem Biol8:593-611 (2001) 
 
Beta-lactamase
Name:Beta-lactamase
Type:Protien
Mol. Mass.:41561.62
Organism:Escherichia coli
Description:P00811
Residue:377
BDBM39846
NameBDBM39846
Synonyms:Amide and sulfonamide derivatives, 30
TypeSmall organic molecule
Emp. Form.C10H8BClN2O6S2
Mol. Mass.362.574
SMILESOB(O)c1cccc(NS(=O)(=O)c2cc(c(Cl)s2)N(=O)=O)c1