Reaction Details
TargetHIV-1 protease
LigandBDBM40775
Substrate/Competitorn/a
Meas. Tech.Enzyme Inhibition Assay
Ki 3200±0.0 nM
Citation Chen, CASieburth, SMGlekas, AHewitt, GWTrainor, GLErickson-Viitanen, SGarber, SSCordova, BJeffry, SKlabe, RM Drug design with a new transition state analog of the hydrated carbonyl: silicon-based inhibitors of the HIV protease. Chem Biol8:1161-6 (2001) 
 
HIV-1 protease
Name:HIV-1 protease
Synonyms:HIV-1 protease wild type
Type:Protein
Mol. Mass.:10757.68
Organism:Human immunodeficiency virus
Description:O90785
Residue:99
BDBM40775
NameBDBM40775
Synonyms:Carbinol, 18a
TypeSmall organic molecule
Emp. Form.C35H38N2O3
Mol. Mass.534.6878
SMILESOC(C[C@@H](Cc1ccccc1)C(=O)NCc1ccccc1)C[C@@H](Cc1ccccc1)C(=O)NCc1ccccc1