Reaction Details
TargetHIV-1 protease
LigandBDBM517
Substrate/Competitorn/a
Meas. Tech.Enzyme Inhibition Assay
Ki 0.37±0.0 nM
Citation Chen, CASieburth, SMGlekas, AHewitt, GWTrainor, GLErickson-Viitanen, SGarber, SSCordova, BJeffry, SKlabe, RM Drug design with a new transition state analog of the hydrated carbonyl: silicon-based inhibitors of the HIV protease. Chem Biol8:1161-6 (2001) 
 
HIV-1 protease
Name:HIV-1 protease
Synonyms:HIV-1 protease wild type
Type:Protein
Mol. Mass.:10757.68
Organism:Human immunodeficiency virus
Description:O90785
Residue:99
BDBM517
NameBDBM517
TypeSmall organic molecule
Emp. Form.C36H47N5O4
Mol. Mass.613.7895
SMILESCC(C)(C)NC(=O)[C@@H]1CN(Cc2cccnc2)CCN1C[C@@H](O)C[C@@H](Cc1ccccc1)C(=O)N[C@@H]1[C@H](O)Cc2ccccc12