Reaction Details
TargetAlpha-2C adrenergic receptor
LigandBDBM81979
Substrate/Competitorn/a
Ki>10000±n/a nM
Citation Weber, ESonders, MQuarum, MMcLean, SPou, SKeana, JF 1,3-Di(2-[5-3H]tolyl)guanidine: a selective ligand that labels sigma-type receptors for psychotomimetic opiates and antipsychotic drugs. Proc Natl Acad Sci U S A83:8784-8 (1986) 
 
Alpha-2C adrenergic receptor
Name:Alpha-2C adrenergic receptor
Type:Enzyme Catalytic Domain
Mol. Mass.:49890.50
Organism:RAT
Description:adrenergic Alpha2 0 RAT::P22086
Residue:458
BDBM81979
NameBDBM81979
Synonyms:CAS_5051-62-7 Fluprofylline NSC_3517 | NSC_65636
TypeSmall organic molecule
Emp. Form.C8H8Cl2N4
Mol. Mass.231.082
SMILES[#7]\[#6](-[#7])=[#7]\[#7]=[#6]-c1c(Cl)cccc1Cl