Reaction Details
TargetE3 ubiquitin-protein ligase Mdm2
LigandBDBM43472
Substrate/Competitorn/a
Meas. Tech.E3 Ligase dose-response_384
EC50 6750±n/a nM
Citation PubChem, PC E3 Ligase dose-response_384 PubChem Bioassay(2008)[AID]
 
E3 ubiquitin-protein ligase Mdm2
Name:E3 ubiquitin-protein ligase Mdm2
Type:Oncoprotein
Mol. Mass.:55196.54
Organism:Homo sapiens (Human)
Description:Q00987
Residue:491
BDBM43472
NameBDBM43472
Synonyms:MLS000419411 N-(1,3-dioxo-5-isoindolyl)-2,3-dihydro-1,4-benzodioxin-3-carboxamide N-[1,3-bis(oxidanylidene)isoindol-5-yl]-2,3-dihydro-1,4-benzodioxine-3-carboxamide cid_4641353
TypeSmall organic molecule
Emp. Form.C17H12N2O5
Mol. Mass.324.2876
SMILESO=C(Nc1ccc2C(=O)NC(=O)c2c1)C1COc2ccccc2O1