Reaction Details
TargetPhosphotransferase
LigandBDBM43834
Substrate/Competitorn/a
Meas. Tech.Inhibition Assay
Temperature298.15±0 K
Ki 2.5e+4± 6e+2 nM
IC50 3000000±0.0 nM
Citation Willson, MSanejouand, YHPerie, JHannaert, VOpperdoes, F Sequencing, modeling, and selective inhibition of Trypanosoma brucei hexokinase. Chem Biol9:839-47 (2002) 
 
Phosphotransferase
Name:Phosphotransferase
Synonyms:Hexokinase
Type:Protein
Mol. Mass.:51306.14
Organism:Trypanosoma brucei
Description:Q38C42
Residue:471
BDBM43834
NameBDBM43834
TypeSmall organic molecule
Emp. Form.C19H23N3O4
Mol. Mass.357.4036
SMILESCOc1cc(CN2CCN(CC2)c2ccc(C)cc2)cc(c1O)[N+]([O-])=O