Reaction Details
TargetHIV-1 protease
LigandBDBM586088
Substrate/Competitorn/a
Meas. Tech.Inhibition Assay
pH5.6±0
Temperature310.15±0 K
IC50 10±0.0 nM
Citation Brik, ALin, YCElder, JWong, CH A quick diversity-oriented amide-forming reaction to optimize P-subsite residues of HIV protease inhibitors. Chem Biol9:891-6 (2002) 
 
HIV-1 protease
Name:HIV-1 protease
Synonyms:HIV-1 protease wild type
Type:Protein
Mol. Mass.:10757.68
Organism:Human immunodeficiency virus
Description:O90785
Residue:99
BDBM586088
NameBDBM586088
Synonyms:P3-P3' Entry 6
Typen/a
Emp. Form.C48H52N6O6
Mol. Mass.808.9631
SMILESCC(C)[C@H](NC(=O)c1ccc2ccccc2n1)C(=O)N[C@@H](Cc1ccccc1)[C@@H](O)[C@H](O)[C@H](Cc1ccccc1)NC(=O)[C@@H](NC(=O)c1ccc2ccccc2n1)C(C)C