Reaction Details
TargetMyeloperoxidase
LigandBDBM312173
Substrate/Competitorn/a
Meas. Tech.Pharmacological Activity Assay
IC50 42.0±n/a nM
Citation Inghardt, TBJohannesson, PJurva, UMichaelsson, ELindstedt-Alstermark, ETomkinson, NStonehouse, JPGan, L 1-[2-(aminomethyl)benzyl]-2-thioxo-1,2,3,5-tetrahydro-4H-pyrrolo[3,2-d]pyrimidin-4-ones as inhibitors of myeloperoxidase US Patent US10016430 Publication Date 7/10/2018
 
Myeloperoxidase
Name:Myeloperoxidase
Type:Enzyme
Mol. Mass.:83888.32
Organism:Homo sapiens (Human)
Description:P05164
Residue:745
BDBM312173
NameBDBM312173
Synonyms:1-{2-[(1S)-1-Aminoethyl]-4-chlorobenzyl}-2-thioxo-1,2,3,5-tetrahydro-4H-pyrrolo[3,2-d]pyrimidin-4-one US11000525, Example 4b | US9616063, 4b
TypeSmall organic molecule
Emp. Form.C15H15ClN4OS
Mol. Mass.334.824
SMILESC[C@H](N)c1cc(Cl)ccc1Cn1c2cc[nH]c2c(=O)[nH]c1=S