Reaction Details
Target3C-like protease
LigandBDBM47887
Substrate/Competitorn/a
Meas. Tech.QFRET-based dose response biochemical high throughput screening assay to identify inhibitors of the SARS coronavirus 3C-like Protease (3CLPro)
IC50 4234±n/a nM
Citation PubChem, PC QFRET-based dose response biochemical high throughput screening assay to identify inhibitors of the SARS coronavirus 3C-like Protease (3CLPro) PubChem Bioassay(2009)[AID]
 
3C-like protease
Name:3C-like protease
Synonyms:n/a
Type:Enzyme Catalytic Domain
Mol. Mass.:33462.05
Organism:Avian infectious bronchitis virus
Description:gi_73745819
Residue:307
BDBM47887
NameBDBM47887
TypeSmall organic molecule
Emp. Form.C19H25ClN4OS
Mol. Mass.392.946
SMILESCCc1nc(N2CCN(CC2)C(=O)CCl)c2c3CCC(C)Cc3sc2n1