Reaction Details
Target3C-like protease
LigandBDBM47895
Substrate/Competitorn/a
Meas. Tech.QFRET-based dose response biochemical high throughput screening assay to identify inhibitors of the SARS coronavirus 3C-like Protease (3CLPro)
IC50 9097±n/a nM
Citation PubChem, PC QFRET-based dose response biochemical high throughput screening assay to identify inhibitors of the SARS coronavirus 3C-like Protease (3CLPro) PubChem Bioassay(2009)[AID]
 
3C-like protease
Name:3C-like protease
Synonyms:n/a
Type:Enzyme Catalytic Domain
Mol. Mass.:33462.05
Organism:Avian infectious bronchitis virus
Description:gi_73745819
Residue:307
BDBM47895
NameBDBM47895
TypeSmall organic molecule
Emp. Form.C16H20FN3O3
Mol. Mass.321.3467
SMILESCC(=O)NC1C(=O)N(CCN2CCOCC2)c2ccc(F)cc12