Reaction Details
Target3C-like protease
LigandBDBM47908
Substrate/Competitorn/a
Meas. Tech.QFRET-based dose response biochemical high throughput screening assay to identify inhibitors of the SARS coronavirus 3C-like Protease (3CLPro)
IC50 2299±n/a nM
Citation PubChem, PC QFRET-based dose response biochemical high throughput screening assay to identify inhibitors of the SARS coronavirus 3C-like Protease (3CLPro) PubChem Bioassay(2009)[AID]
 
3C-like protease
Name:3C-like protease
Synonyms:n/a
Type:Enzyme Catalytic Domain
Mol. Mass.:33462.05
Organism:Avian infectious bronchitis virus
Description:gi_73745819
Residue:307
BDBM47908
NameBDBM47908
TypeSmall organic molecule
Emp. Form.C17H17ClN2O3S
Mol. Mass.364.846
SMILESCOc1ccc(cc1OC)C1CC(=NN1C(=O)CCl)c1cccs1