Reaction Details
Target3C-like protease
LigandBDBM47916
Substrate/Competitorn/a
Meas. Tech.QFRET-based dose response biochemical high throughput screening assay to identify inhibitors of the SARS coronavirus 3C-like Protease (3CLPro)
IC50 2962±n/a nM
Citation PubChem, PC QFRET-based dose response biochemical high throughput screening assay to identify inhibitors of the SARS coronavirus 3C-like Protease (3CLPro) PubChem Bioassay(2009)[AID]
 
3C-like protease
Name:3C-like protease
Synonyms:n/a
Type:Enzyme Catalytic Domain
Mol. Mass.:33462.05
Organism:Avian infectious bronchitis virus
Description:gi_73745819
Residue:307
BDBM47916
NameBDBM47916
TypeSmall organic molecule
Emp. Form.C16H12O5
Mol. Mass.284.2635
SMILESCCc1cc(=O)oc2cc(OC(=O)c3ccco3)ccc12