Reaction Details
TargetHeat shock protein HSP 90-alpha
LigandBDBM48030
Substrate/Competitorn/a
Meas. Tech.Luminescence-based dose response biochemical high throughput screening assay for inhibitors of the Heat Shock Protein 90 (HSP90)
IC50 638.21±n/a nM
Citation PubChem, PC Luminescence-based dose response biochemical high throughput screening assay for inhibitors of the Heat Shock Protein 90 (HSP90) PubChem Bioassay(2009)[AID]
 
Heat shock protein HSP 90-alpha
Name:Heat shock protein HSP 90-alpha
Type:Molecular Chaperone
Mol. Mass.:84623.45
Organism:Homo sapiens (Human)
Description:P07900
Residue:732
BDBM48030
NameBDBM48030
Synonyms:4-[(E)-[3-(2-fluoroanilino)-4-keto-1-naphthylidene]amino]sulfonylbenzoic acid 4-[(E)-[3-(2-fluoroanilino)-4-oxonaphthalen-1-ylidene]amino]sulfonylbenzoic acid MLS000948172 cid_6023694
TypeSmall organic molecule
Emp. Form.C23H15FN2O5S
Mol. Mass.450.439
SMILESOC(=O)c1ccc(cc1)S(=O)(=O)N=C1C=C(Nc2ccccc2F)C(=O)c2ccccc12