Reaction Details
Target6-phosphofructo-2-kinase/fructose-2,6-bisphosphatase 4
LigandBDBM267031
Substrate/Competitorn/a
Meas. Tech.PFKFB4 Assay
IC50 800±n/a nM
Citation Martinsson, JFaernegardh, KJoensson, MRingom, R Bisarylsulfonamides useful in the treatment of inflammation and cancer US Patent US9718809 Publication Date 8/1/2017
 
6-phosphofructo-2-kinase/fructose-2,6-bisphosphatase 4
Name:6-phosphofructo-2-kinase/fructose-2,6-bisphosphatase 4
Type:Enzyme
Mol. Mass.:54039.68
Organism:Homo sapiens (Human)
Description:Q16877
Residue:469
BDBM267031
NameBDBM267031
Synonyms:4-{[(5-Chloro-4-phenyl-2-thienyl)sulfonyl]amino}-2-hydroxybenzoic acid | US9718809, 27
TypeSmall organic molecule
Emp. Form.C17H12ClNO5S2
Mol. Mass.409.864
SMILESOC(=O)c1ccc(NS(=O)(=O)c2cc(c(Cl)s2)-c2ccccc2)cc1O