Reaction Details
Target6-phosphofructo-2-kinase/fructose-2,6-bisphosphatase 4
LigandBDBM267038
Substrate/Competitorn/a
Meas. Tech.PFKFB4 Assay
IC50 2100±n/a nM
Citation Martinsson, JFaernegardh, KJoensson, MRingom, R Bisarylsulfonamides useful in the treatment of inflammation and cancer US Patent US9718809 Publication Date 8/1/2017
 
6-phosphofructo-2-kinase/fructose-2,6-bisphosphatase 4
Name:6-phosphofructo-2-kinase/fructose-2,6-bisphosphatase 4
Type:Enzyme
Mol. Mass.:54039.68
Organism:Homo sapiens (Human)
Description:Q16877
Residue:469
BDBM267038
NameBDBM267038
Synonyms:Methyl 4-({[5-(dimethylamino)naphthalen-1-yl]sulfonyl}amino)-2-hydroxybenzoate trifluoroacetate | US9718809, 40
TypeSmall organic molecule
Emp. Form.C20H20N2O5S
Mol. Mass.400.448
SMILESCOC(=O)c1ccc(NS(=O)(=O)c2cccc3c(cccc23)N(C)C)cc1O