Reaction Details
Target6-phosphofructo-2-kinase/fructose-2,6-bisphosphatase 4
LigandBDBM267039
Substrate/Competitorn/a
Meas. Tech.PFKFB4 Assay
IC50 1500±n/a nM
Citation Martinsson, JFaernegardh, KJoensson, MRingom, R Bisarylsulfonamides useful in the treatment of inflammation and cancer US Patent US9718809 Publication Date 8/1/2017
 
6-phosphofructo-2-kinase/fructose-2,6-bisphosphatase 4
Name:6-phosphofructo-2-kinase/fructose-2,6-bisphosphatase 4
Type:Enzyme
Mol. Mass.:54039.68
Organism:Homo sapiens (Human)
Description:Q16877
Residue:469
BDBM267039
NameBDBM267039
Synonyms:Methyl 2-hydroxy-4-({[3-(piperidin-1-yl)phenyl]sulfonyl}amino)benzoate | US9718809, 142
TypeSmall organic molecule
Emp. Form.C19H22N2O5S
Mol. Mass.390.453
SMILESCOC(=O)c1ccc(NS(=O)(=O)c2cccc(c2)N2CCCCC2)cc1O