Reaction Details
Target6-phosphofructo-2-kinase/fructose-2,6-bisphosphatase 4
LigandBDBM267068
Substrate/Competitorn/a
Meas. Tech.PFKFB4 Assay
IC50 1080±n/a nM
Citation Martinsson, JFaernegardh, KJoensson, MRingom, R Bisarylsulfonamides useful in the treatment of inflammation and cancer US Patent US9718809 Publication Date 8/1/2017
 
6-phosphofructo-2-kinase/fructose-2,6-bisphosphatase 4
Name:6-phosphofructo-2-kinase/fructose-2,6-bisphosphatase 4
Type:Enzyme
Mol. Mass.:54039.68
Organism:Homo sapiens (Human)
Description:Q16877
Residue:469
BDBM267068
NameBDBM267068
Synonyms:General Procedure 9 | US9718809, 82
TypeSmall organic molecule
Emp. Form.C20H17NO6S
Mol. Mass.399.417
SMILESCOC(=O)c1ccc(NS(=O)(=O)c2cccc(c2)-c2ccccc2O)cc1O