Reaction Details
Target6-phosphofructo-2-kinase/fructose-2,6-bisphosphatase 4
LigandBDBM267070
Substrate/Competitorn/a
Meas. Tech.PFKFB4 Assay
IC50 1800±n/a nM
Citation Martinsson, JFaernegardh, KJoensson, MRingom, R Bisarylsulfonamides useful in the treatment of inflammation and cancer US Patent US9718809 Publication Date 8/1/2017
 
6-phosphofructo-2-kinase/fructose-2,6-bisphosphatase 4
Name:6-phosphofructo-2-kinase/fructose-2,6-bisphosphatase 4
Type:Enzyme
Mol. Mass.:54039.68
Organism:Homo sapiens (Human)
Description:Q16877
Residue:469
BDBM267070
NameBDBM267070
Synonyms:1-Benzylpyrrolidin-3-yl 2-hydroxy-4-{[(2,4,5-trichloro-3-thienyl)sulfonyl]amino}benzoate | US9718809, 204
TypeSmall organic molecule
Emp. Form.C22H19Cl3N2O5S2
Mol. Mass.561.886
SMILESOc1cc(NS(=O)(=O)c2c(Cl)sc(Cl)c2Cl)ccc1C(=O)OC1CCN(Cc2ccccc2)C1