Reaction Details
TargetEstrogen receptor beta
LigandBDBM40211
Substrate/Competitorn/a
Meas. Tech.Estrogen Receptor-beta Coactivator Binding Inhibitors ELISA Secondary Assay
IC50 23±n/a nM
Citation PubChem, PC Estrogen Receptor-beta Coactivator Binding Inhibitors ELISA Secondary Assay PubChem Bioassay(2008)[AID]
 
Estrogen receptor beta
Name:Estrogen receptor beta
Type:Protein
Mol. Mass.:59238.43
Organism:Homo sapiens (Human)
Description:Q92731
Residue:530
BDBM40211
NameBDBM40211
Synonyms:5-(tosylmethyl)-2-furoic acid 5-[(4-methylphenyl)sulfonylmethyl]furan-2-carboxylic acid SMR000132396 | cid_9551108
TypeSmall organic molecule
Emp. Form.C13H12O5S
Mol. Mass.280.296
SMILESCc1ccc(cc1)S(=O)(=O)Cc1ccc(o1)C(O)=O