Reaction Details
TargetEstrogen receptor beta
LigandBDBM50106345
Substrate/Competitorn/a
Meas. Tech.Estrogen Receptor-beta Coactivator Binding Inhibitors ELISA Secondary Assay
IC50 7125.861482±n/a nM
Citation PubChem, PC Estrogen Receptor-beta Coactivator Binding Inhibitors ELISA Secondary Assay PubChem Bioassay(2008)[AID]
 
Estrogen receptor beta
Name:Estrogen receptor beta
Type:Protein
Mol. Mass.:59238.43
Organism:Homo sapiens (Human)
Description:Q92731
Residue:530
BDBM50106345
NameBDBM50106345
Synonyms:4-(4-Methyl-piperazin-1-yl)-phenylamine cid_737253
TypeSmall organic molecule
Emp. Form.C11H17N3
Mol. Mass.191.2728
SMILESCN1CCN(CC1)c1ccc(N)cc1