Reaction Details
TargetIntegrin alpha-4
LigandBDBM37061
Substrate/Competitorn/a
Meas. Tech.Dose-Response of Allosteric Antagonists for the VLA-4 Integrin
EC50 6780±n/a nM
Citation PubChem, PC Dose-Response of Allosteric Antagonists for the VLA-4 Integrin PubChem Bioassay(2007)[AID]
 
Integrin alpha-4
Name:Integrin alpha-4
Type:Membrane Protein
Mol. Mass.:114897.35
Organism:Homo sapiens (Human)
Description:P13612
Residue:1032
BDBM37061
NameBDBM37061
Synonyms:(4-methoxy-1,3-benzothiazol-2-yl)-[4-(2-pyridyl)thiazol-2-yl]amine 4-methoxy-N-[4-(2-pyridinyl)-2-thiazolyl]-1,3-benzothiazol-2-amine SMR000027216 | cid_3240629
TypeSmall organic molecule
Emp. Form.C16H12N4OS2
Mol. Mass.340.423
SMILESCOc1cccc2sc(Nc3nc(cs3)-c3ccccn3)nc12