Reaction Details
TargetIntegrin alpha-4
LigandBDBM39877
Substrate/Competitorn/a
Meas. Tech.Dose-Response of Allosteric Antagonists for the VLA-4 Integrin
EC50 80±n/a nM
Citation PubChem, PC Dose-Response of Allosteric Antagonists for the VLA-4 Integrin PubChem Bioassay(2007)[AID]
 
Integrin alpha-4
Name:Integrin alpha-4
Type:Membrane Protein
Mol. Mass.:114897.35
Organism:Homo sapiens (Human)
Description:P13612
Residue:1032
BDBM39877
NameBDBM39877
Synonyms:4-[[2-[[2-(3,4-dimethoxyphenyl)-5-methyl-4-oxazolyl]methylthio]-1-oxoethyl]amino]-1-piperidinecarboxylic acid ethyl ester MLS000089359 cid_3240527 ethyl 4-[[2-[[2-(3,4-dimethoxyphenyl)-5-methyl-1,3-oxazol-4-yl]methylsulfanyl]acetyl]amino]piperidine-1-carboxylate | ethyl 4-{[({[2-(3,4-dimethoxyphenyl)-5-methyl-1,3-oxazol-4-yl]methyl}thio)acetyl]amino}piperidine-1-carboxylate
TypeSmall organic molecule
Emp. Form.C23H31N3O6S
Mol. Mass.477.574
SMILESCCOC(=O)N1CCC(CC1)NC(=O)CSCc1nc(oc1C)-c1ccc(OC)c(OC)c1