Reaction Details
TargetGuanyl-specific ribonuclease T1
LigandBDBM55014
Substrate/Competitorn/a
Meas. Tech.Counterscreen for inhibitors of tRNA 2'-phosphotransferase (TPT1): fluorescence polarization-based biochemical high throughput dose response assay to identify inhibitors of RNAse T1.
IC50 7800±n/a nM
Citation PubChem, PC Counterscreen for inhibitors of tRNA 2'-phosphotransferase (TPT1): fluorescence polarization-based biochemical high throughput dose response assay to identify inhibitors of RNAse T1. PubChem Bioassay(2009)[AID]
 
Guanyl-specific ribonuclease T1
Name:Guanyl-specific ribonuclease T1
Type:Enzyme Catalytic Domain
Mol. Mass.:13952.57
Organism:Aspergillus oryzae
Description:gi_83774548
Residue:130
BDBM55014
NameBDBM55014
Synonyms:MLS000924860 cid_20868233
TypeSmall organic molecule
Emp. Form.C29H29N5O4
Mol. Mass.511.5717
SMILESCCN1CCN(CC1)c1cc(N2CCN(CC2)C(=O)c2ccco2)c2C(=O)c3ccccc3-c3onc1c23