Reaction Details
TargetMetabotropic glutamate receptor 4
LigandBDBM50293717
Substrate/Competitorn/a
Meas. Tech.Modulation of the Metabotropic Glutamate Receptor mGluR4: Potency at human mGluR4
EC50 3650±n/a nM
Citation PubChem, PC Modulation of the Metabotropic Glutamate Receptor mGluR4: Potency at human mGluR4 PubChem Bioassay(2010)[AID]
 
Metabotropic glutamate receptor 4
Name:Metabotropic glutamate receptor 4
Type:Protein
Mol. Mass.:101899.95
Organism:Homo sapiens (Human)
Description:Q14833
Residue:912
BDBM50293717
NameBDBM50293717
Synonyms:CHEMBL572346 cid_2447227
TypeSmall organic molecule
Emp. Form.C14H14N2O3
Mol. Mass.258.2726
SMILESCOc1ccc(NC(=O)c2ccccn2)cc1OC