Reaction Details
TargetCoagulation factor VIII
LigandBDBM59164
Substrate/Competitorn/a
Meas. Tech.Inhibition Assay
Temperature310.15±0 K
IC50 4.17e+3± 5.9e+2 nM
Citation Spiegel, PCKaiser, SMSimon, JAStoddard, BL Disruption of protein-membrane binding and identification of small-molecule inhibitors of coagulation factor VIII. Chem Biol11:1413-22 (2004) 
 
Coagulation factor VIII
Name:Coagulation factor VIII
Type:Protein
Mol. Mass.:267036.98
Organism:Homo sapiens (Human)
Description:P00451
Residue:2351
BDBM59164
NameBDBM59164
Synonyms:8048422
TypeSmall organic molecule
Emp. Form.C16H8ClN2O5S
Mol. Mass.375.764
SMILES[#8-]-[#6](=O)-c1cc(ccc1Cl)-c1ccc(\[#6]=[#6]-2/[#6](=O)-[#7]-[#6](=S)-[#7]-[#6]-2=O)o1