Reaction Details
TargetCoagulation factor VIII
LigandBDBM59153
Substrate/Competitorn/a
Meas. Tech.Inhibition Assay
pH7.9±0
IC50 8.5e+3±n/a nM
Citation Spiegel, PCKaiser, SMSimon, JAStoddard, BL Disruption of protein-membrane binding and identification of small-molecule inhibitors of coagulation factor VIII. Chem Biol11:1413-22 (2004) 
 
Coagulation factor VIII
Name:Coagulation factor VIII
Type:Protein
Mol. Mass.:267036.98
Organism:Homo sapiens (Human)
Description:P00451
Residue:2351
BDBM59153
NameBDBM59153
Synonyms:5737176
TypeSmall organic molecule
Emp. Form.C15H7BrF3NO2S2
Mol. Mass.434.251
SMILESFC(F)(F)c1cccc(c1)N1C(=S)S\C(=C/c2ccc(Br)o2)C1=O