Reaction Details
TargetCyclin-dependent kinase 2
LigandBDBM59253
Substrate/Competitorn/a
Meas. Tech.Enzymatic Assay
IC50 2e+1±n/a nM
EC50 7e+1±n/a nM
Citation Caligiuri, MMolz, LLiu, QKaplan, FXu, JPMajeti, JZRamos-Kelsey, RMurthi, KLievens, STavernier, JKley, N MASPIT: three-hybrid trap for quantitative proteome fingerprinting of small molecule-protein interactions in mammalian cells. Chem Biol13:711-22 (2006) 
 
Cyclin-dependent kinase 2
Name:Cyclin-dependent kinase 2
Type:Enzyme Subunit
Mol. Mass.:33938.17
Organism:Homo sapiens (Human)
Description:P24941
Residue:298
BDBM59253
NameBDBM59253
Synonyms:RGB-285961
TypeSmall organic molecule
Emp. Form.C25H23Cl3N4O4
Mol. Mass.549.834
SMILESCC(C)c1nn(-c2c(Cl)cc(Cl)cc2Cl)c2nc(Cc3ccc(OC(C)(C)C(O)=O)cc3)[nH]c(=O)c12