Reaction Details
TargetNucleotide-binding oligomerization domain-containing protein 1
LigandBDBM45060
Substrate/Competitorn/a
Meas. Tech.SAR analysis of Antagonists of the GPR35 Receptor using an Image-Based Assay - Set 2
IC50 105±n/a nM
Citation PubChem, PC SAR analysis of Antagonists of the GPR35 Receptor using an Image-Based Assay - Set 2 PubChem Bioassay(2010)[AID]
 
Nucleotide-binding oligomerization domain-containing protein 1
Name:Nucleotide-binding oligomerization domain-containing protein 1
Type:Enzyme Catalytic Domain
Mol. Mass.:107699.03
Organism:Homo sapiens (Human)
Description:gi_5174617
Residue:953
BDBM45060
NameBDBM45060
Synonyms:4-({4-[5-(2-methyl-3-phenyl-2-propen-1-ylidene)-4-oxo-2-thioxo-1,3-thiazolidin-3-yl]butanoyl}amino)benzoic acid 4-[4-[(5Z)-5-[(E)-2-methyl-3-phenyl-prop-2-enylidene]-4-oxidanylidene-2-sulfanylidene-1,3-thiazolidin-3-yl]butanoylamino]benzoic acid 4-[[4-[(5Z)-5-[(E)-2-methyl-3-phenylprop-2-enylidene]-4-oxo-2-sulfanylidene-3-thiazolidinyl]-1-oxobutyl]amino]benzoic acid SMR000208965 | cid_2286888
TypeSmall organic molecule
Emp. Form.C24H22N2O4S2
Mol. Mass.466.572
SMILESC\C(\C=C1/SC(=S)N(CCCC(=O)Nc2ccc(cc2)C(O)=O)C1=O)=C/c1ccccc1