Reaction Details
TargetS-ribosylhomocysteine lyase
LigandBDBM65976
Substrate/Competitorn/a
Meas. Tech.Absorbance Microorganism-Based Dose Retest to Identify Inhibitors of Vibrio harveyi
EC50>160000±n/a nM
Citation PubChem, PC Absorbance Microorganism-Based Dose Retest to Identify Inhibitors of Vibrio harveyi PubChem Bioassay(2010)[AID]
 
S-ribosylhomocysteine lyase
Name:S-ribosylhomocysteine lyase
Synonyms:LuxS
Type:Enzyme Catalytic Domain
Mol. Mass.:15564.06
Organism:Vibrio harveyi
Description:B0LUE4
Residue:140
BDBM65976
NameBDBM65976
TypeSmall organic molecule
Emp. Form.C18H16N2O3S
Mol. Mass.340.396
SMILESCc1cccc(NS(=O)(=O)c2ccc(Oc3ccccc3)cc2)n1