Reaction Details
TargetKrueppel-like factor 5
LigandBDBM70201
Substrate/Competitorn/a
Meas. Tech.Late stage results from the probe development effort to identify inhibitors of kruppel-like factor 5 (KLF5): luminescence-based cell-based dose response assay for inhibitors of KLF5 (Round 1)
IC50 4556±n/a nM
Citation PubChem, PC Late stage results from the probe development effort to identify inhibitors of kruppel-like factor 5 (KLF5): luminescence-based cell-based dose response assay for inhibitors of KLF5 (Round 1) PubChem Bioassay(2010)[AID]
 
Krueppel-like factor 5
Name:Krueppel-like factor 5
Type:Enzyme Catalytic Domain
Mol. Mass.:50808.71
Organism:Homo sapiens (Human)
Description:Q13887
Residue:457
BDBM70201
NameBDBM70201
Synonyms:N-[2-(4-fluorophenyl)-5-benzotriazolyl]-2,2-dimethylpropanamide N-[2-(4-fluorophenyl)benzotriazol-5-yl]-2,2-dimethyl-propionamide SR-03000001317 cid_17027240
TypeSmall organic molecule
Emp. Form.C17H17FN4O
Mol. Mass.312.3415
SMILESCC(C)(C)C(=O)Nc1ccc2nn(nc2c1)-c1ccc(F)cc1