Reaction Details
TargetKrueppel-like factor 5
LigandBDBM70205
Substrate/Competitorn/a
Meas. Tech.Late stage results from the probe development effort to identify inhibitors of kruppel-like factor 5 (KLF5): luminescence-based cell-based dose response assay for inhibitors of KLF5 (Round 1)
IC50>39841±n/a nM
Citation PubChem, PC Late stage results from the probe development effort to identify inhibitors of kruppel-like factor 5 (KLF5): luminescence-based cell-based dose response assay for inhibitors of KLF5 (Round 1) PubChem Bioassay(2010)[AID]
 
Krueppel-like factor 5
Name:Krueppel-like factor 5
Type:Enzyme Catalytic Domain
Mol. Mass.:50808.71
Organism:Homo sapiens (Human)
Description:Q13887
Residue:457
BDBM70205
NameBDBM70205
Synonyms:(6-ethoxy-1,3-benzothiazol-2-yl)-(6-fluoro-1,3-benzothiazol-2-yl)amine 6-ethoxy-N-(6-fluoro-1,3-benzothiazol-2-yl)-1,3-benzothiazol-2-amine SR-03000001322-1 | cid_7110033
TypeSmall organic molecule
Emp. Form.C16H12FN3OS2
Mol. Mass.345.414
SMILESCCOc1ccc2nc(Nc3nc4ccc(F)cc4s3)sc2c1