Reaction Details
TargetKrueppel-like factor 5
LigandBDBM70207
Substrate/Competitorn/a
Meas. Tech.Late stage results from the probe development effort to identify inhibitors of kruppel-like factor 5 (KLF5): luminescence-based cell-based dose response assay for inhibitors of KLF5 (Round 1)
IC50>39841±n/a nM
Citation PubChem, PC Late stage results from the probe development effort to identify inhibitors of kruppel-like factor 5 (KLF5): luminescence-based cell-based dose response assay for inhibitors of KLF5 (Round 1) PubChem Bioassay(2010)[AID]
 
Krueppel-like factor 5
Name:Krueppel-like factor 5
Type:Enzyme Catalytic Domain
Mol. Mass.:50808.71
Organism:Homo sapiens (Human)
Description:Q13887
Residue:457
BDBM70207
NameBDBM70207
Synonyms:(6-fluoro-1,3-benzothiazol-2-yl)-(6-methoxy-1,3-benzothiazol-2-yl)amine N-(6-fluoro-1,3-benzothiazol-2-yl)-6-methoxy-1,3-benzothiazol-2-amine SR-03000001324-1 | cid_7110003
TypeSmall organic molecule
Emp. Form.C15H10FN3OS2
Mol. Mass.331.388
SMILESCOc1ccc2nc(Nc3nc4ccc(F)cc4s3)sc2c1