Reaction Details
TargetKrueppel-like factor 5
LigandBDBM70208
Substrate/Competitorn/a
Meas. Tech.Late stage results from the probe development effort to identify inhibitors of kruppel-like factor 5 (KLF5): luminescence-based cell-based dose response assay for inhibitors of KLF5 (Round 1)
IC50>39841±n/a nM
Citation PubChem, PC Late stage results from the probe development effort to identify inhibitors of kruppel-like factor 5 (KLF5): luminescence-based cell-based dose response assay for inhibitors of KLF5 (Round 1) PubChem Bioassay(2010)[AID]
 
Krueppel-like factor 5
Name:Krueppel-like factor 5
Type:Enzyme Catalytic Domain
Mol. Mass.:50808.71
Organism:Homo sapiens (Human)
Description:Q13887
Residue:457
BDBM70208
NameBDBM70208
Synonyms:N-(5-acetyl-4-methyl-1,3-thiazol-2-yl)-1,3-benzothiazole-6-carboxamide N-(5-acetyl-4-methyl-thiazol-2-yl)-1,3-benzothiazole-6-carboxamide SR-03000001325 cid_2412252
TypeSmall organic molecule
Emp. Form.C14H11N3O2S2
Mol. Mass.317.386
SMILESCC(=O)c1sc(NC(=O)c2ccc3ncsc3c2)nc1C